Top Page [◀◀]  2   3   4   5   6   7   8   9   ... [▶▶Last Page

サンプルプログラム(D6000804)のビルド方法について

ルネサスの以下のURLにあるサンプルプログラムをビルドしたいのですが

プロジェクトをインポートしてビルドをしても13件のエラー(主に~.hが見つからない等)がでて

上手くビルドが通りません。どなたかビルドを通す方法を教えてください。

https://www.renesas.com/jp/ja/software/D6000804.html

 

ビルド環境は

・E2 Studio(ver 6.2.1)

・OS Windows7

・評価基盤 PK-S5D9

何卒宜しくお願い致します。

  • わわいです
    その、出ているというエラーメッセージのいくつかをコピペして(改変せずに)提示してくれませんか
  • 返信ありがとうございます。以下のようなエラーがでます。
    src/subdir.mk:36: recipe for target 'src/bldc_on_gpt.o' failed
    make: *** [src/bldc_on_gpt.o] Error 1
    make: *** Waiting for unfinished jobs....
    ../src/hal_entry.c:2:10: fatal error: 'hal_data.h' file not found
    #include "hal_data.h"
    ^
    1 error generated.
    ../src/bldc_thread_entry.c:31:10: fatal error: 'bldc_thread.h' file not found
    #include "bldc_thread.h"
    ^
    1 error generated.
    ../src/hmi_event_handler.c:24:10: fatal error: 'gx_api.h' file not found
    #include "gx_api.h"
    ^
    1 error generated.
    make: *** [src/hal_entry.o] Error 1
    src/subdir.mk:36: recipe for target 'src/hal_entry.o' failed
    make: *** [src/bldc_thread_entry.o] Error 1
    src/subdir.mk:36: recipe for target 'src/bldc_thread_entry.o' failed
    make: *** [src/hmi_event_handler.o] Error 1
    src/subdir.mk:36: recipe for target 'src/hmi_event_handler.o' failed

    15:33:36 Build Failed. 13 errors, 0 warnings. (took 2s.101ms)
  • In reply to るさっく:

    るさっく さん
    ほやです。
    インポートしただけだと、そうなりますね。添付のマニュアルにその先の操作方法が書いてあるので、試してみてはいかが。
  • ほや さん
    英語が苦手で必要な手順がイマイチわかりません。
    添付マニュアルのP13にある[Generate Project Content]ボタンを押してビルドしたところ
    エラーの数が激減して以下のようなエラーがでました。ありがとうございます!
    何か抜けてる手順があるのでしょうか?
    アドバイス頂けれると幸いです。

    16:45:18 **** プロジェクト BLDC_HMI_CONTROLLER に対する構成 Debug の ビルド ****
    make -j4 all
    make: *** No rule to make target 'synergy/ssp/src/framework/tes/dave2d/dave_64bitoperation.o', needed by 'BLDC_HMI_CONTROLLER.elf'. Stop.

    16:45:19 Build Failed. 1 errors, 0 warnings. (took 975ms)
  • In reply to るさっく:

    るさっく さん
    恐らく 'synergy/ssp/src/framework/tes/dave2d/dave_64bitoperation.c' というソースファイルをコンフィグレータが吐いていないからではないかと。
    自分は残念ながら(??)ビルドが通ってしまったので、どうしてそうなるかは分かりませんでした。
    サンプルプロジェクトの中身やらSSPの事情までは、ここの住民に聞いても難しいと思うので、もし解決しないようならサポートに相談されてはいかがでしょうか。
  • 色々試しましたが、改善できずサポートに直接問い合わせをしてみます。
    みなさん、いろいろサポートありがとうございました。
  • In reply to るさっく:

    >英語が苦手で必要な手順がイマイチわかりません
    今更ですが、日本語のマニュアルもありました。

    https://www.renesas.com/jp/ja/search/keyword-search.html#q=r11an0023

Top Page [◀◀]  2   3   4   5   6   7   8   9   ... [▶▶Last Page